[infra] Build failed in Jenkins: weirdo-promote-test-puppet-centos8 #2339

ci at centos.org ci at centos.org
Tue Apr 6 05:39:47 UTC 2021


See <https://ci.centos.org/job/weirdo-promote-test-puppet-centos8/2339/display/redirect>

Changes:


------------------------------------------
Started by upstream project "weirdo-promote-puppet-centos8-properties" build number 2339
originally caused by:
 [URLTrigger] A change within the response URL invocation (log)
Running as SYSTEM
[EnvInject] - Loading node environment variables.
[EnvInject] - Preparing an environment for the build.
[EnvInject] - Keeping Jenkins system variables.
[EnvInject] - Keeping Jenkins build variables.
[EnvInject] - Injecting as environment variables the properties content 
ANSIBLE_FORCE_COLOR=1
ANSIBLE_STDOUT_CALLBACK=debug

[EnvInject] - Variables injected successfully.
[EnvInject] - Injecting contributions.
Building remotely on rdo-ci-cloudslave03 (rdo-virtualized) in workspace <https://ci.centos.org/job/weirdo-promote-test-puppet-centos8/ws/>
[WS-CLEANUP] Deleting project workspace...
[WS-CLEANUP] Deferred wipeout is used...
[WS-CLEANUP] Done
[weirdo-promote-test-puppet-centos8] $ /bin/bash /tmp/jenkins7282547972979492331.sh
Waiting for the completion of weirdo-generic-puppet-openstack-scenario001
weirdo-generic-puppet-openstack-scenario001 #19020 started.
weirdo-generic-puppet-openstack-scenario001 #19020 completed. Result was FAILURE
Waiting for the completion of weirdo-generic-puppet-openstack-scenario002
weirdo-generic-puppet-openstack-scenario002 #18962 started.
weirdo-generic-puppet-openstack-scenario002 #18962 completed. Result was FAILURE
Waiting for the completion of weirdo-generic-puppet-openstack-scenario003
weirdo-generic-puppet-openstack-scenario003 #18942 started.
weirdo-generic-puppet-openstack-scenario003 #18942 completed. Result was SUCCESS
Waiting for the completion of weirdo-generic-puppet-openstack-scenario004
weirdo-generic-puppet-openstack-scenario004 #15663 started.
weirdo-generic-puppet-openstack-scenario004 #15663 completed. Result was SUCCESS
Waiting for the completion of weirdo-generic-packstack-scenario001
weirdo-generic-packstack-scenario001 #13357 started.
weirdo-generic-packstack-scenario001 #13357 completed. Result was FAILURE
Waiting for the completion of weirdo-generic-puppet-openstack-scenario001
weirdo-generic-puppet-openstack-scenario001 #19021 started.
weirdo-generic-puppet-openstack-scenario001 #19021 completed. Result was SUCCESS
Waiting for the completion of weirdo-generic-puppet-openstack-scenario002
weirdo-generic-puppet-openstack-scenario002 #18963 started.
weirdo-generic-puppet-openstack-scenario002 #18963 completed. Result was SUCCESS
Waiting for the completion of weirdo-generic-puppet-openstack-scenario003
weirdo-generic-puppet-openstack-scenario003 #18943 started.
weirdo-generic-puppet-openstack-scenario003 #18943 completed. Result was SUCCESS
Waiting for the completion of weirdo-generic-puppet-openstack-scenario004
weirdo-generic-puppet-openstack-scenario004 #15664 started.
weirdo-generic-puppet-openstack-scenario004 #15664 completed. Result was SUCCESS
Waiting for the completion of weirdo-generic-packstack-scenario001
weirdo-generic-packstack-scenario001 #13358 started.
weirdo-generic-packstack-scenario001 #13358 completed. Result was SUCCESS
Build step 'Trigger/call builds on other projects' marked build as failure
Archiving artifacts


More information about the infra mailing list