[rdo-infra-list] Build failed in Jenkins: weirdo-promote-test-puppet #1527

ci at centos.org ci at centos.org
Tue Sep 19 10:54:42 UTC 2017


See <https://ci.centos.org/job/weirdo-promote-test-puppet/1527/display/redirect>

------------------------------------------
Started by upstream project "weirdo-promote-puppet-properties" build number 1550
originally caused by:
 [URLTrigger] A change within the response URL invocation (log)
[EnvInject] - Loading node environment variables.
Building remotely on rdo-ci-cloudslave03 (rdo-virtualized) in workspace <https://ci.centos.org/job/weirdo-promote-test-puppet/ws/>
[WS-CLEANUP] Deleting project workspace...
[WS-CLEANUP] Done
[weirdo-promote-test-puppet] $ /bin/bash /tmp/jenkins2207209832369464237.sh
Waiting for the completion of weirdo-generic-puppet-openstack-scenario001
weirdo-generic-puppet-openstack-scenario001 #2954 completed. Result was FAILURE
Waiting for the completion of weirdo-generic-puppet-openstack-scenario002
weirdo-generic-puppet-openstack-scenario002 #2927 completed. Result was FAILURE
Waiting for the completion of weirdo-generic-puppet-openstack-scenario003
weirdo-generic-puppet-openstack-scenario003 #2934 completed. Result was FAILURE
Waiting for the completion of weirdo-generic-puppet-openstack-scenario004
weirdo-generic-puppet-openstack-scenario004 #454 completed. Result was FAILURE
Build step 'Trigger/call builds on other projects' marked build as failure
Archiving artifacts




More information about the infra mailing list